Reaction Details
TargetVascular endothelial growth factor receptor 2
LigandBDBM208469
Substrate/Competitorn/a
Meas. Tech.VEGFR2 Cellular Assay
Temperature310.15±n/a K
IC50 1±n/a nM
Commentsextracted
Citation Boral, SWang, SMalone, TWurster, JShen, JRobinson, M Substituted dialkyl(oxido)-lambda4-sulfanylidene nicotinamide derivatives as kinase inhibitors US Patent US9266869 Publication Date 2/23/2016
 
Vascular endothelial growth factor receptor 2
Name:Vascular endothelial growth factor receptor 2
Type:Receptor Tyrosine Kinase
Mol. Mass.:151510.97
Organism:Homo sapiens (Human)
Description:P35968
Residue:1356
BDBM208469
NameBDBM208469
Synonyms:US9266869, 27
TypeSmall organic molecule
Emp. Form.C29H26F4N4O5S
Mol. Mass.618.599
SMILESCOC(=O)CCCCS(C)(=O)=NC(=O)c1cnc(N)c(c1)C#Cc1cccc(NC(=O)c2cc(ccc2F)C(F)(F)F)c1