Reaction Details
TargetVascular endothelial growth factor receptor 2
LigandBDBM208478
Substrate/Competitorn/a
Meas. Tech.VEGFR2 Cellular Assay
Temperature310.15±n/a K
IC50 1±n/a nM
Commentsextracted
Citation Boral, SWang, SMalone, TWurster, JShen, JRobinson, M Substituted dialkyl(oxido)-lambda4-sulfanylidene nicotinamide derivatives as kinase inhibitors US Patent US9266869 Publication Date 2/23/2016
 
Vascular endothelial growth factor receptor 2
Name:Vascular endothelial growth factor receptor 2
Type:Receptor Tyrosine Kinase
Mol. Mass.:151510.97
Organism:Homo sapiens (Human)
Description:P35968
Residue:1356
BDBM208478
NameBDBM208478
Synonyms:US9266869, 36
TypeSmall organic molecule
Emp. Form.C29H33N5O6S
Mol. Mass.579.667
SMILESCOC(=O)CCCCS(C)(=O)=NC(=O)c1cnc(N)c(c1)C#Cc1cccc(c1)C(=O)Nc1cc(on1)C(C)(C)C