Reaction Details
TargetC-X-C chemokine receptor type 3/Guanine nucleotide-binding protein subunit alpha-15
LigandBDBM208632
Substrate/Competitorn/a
Meas. Tech.FLIPR Assay
pH7.4±n/a
Temperature310.15±n/a K
IC50 1±n/a nM
Commentsextracted
Citation Caroff, EKeller, MKimmerlin, TMeyer, E 4-(benzoimidazol-2-yl)-thiazole compounds and related aza derivatives US Patent US9266876 Publication Date 2/23/2016
 
C-X-C chemokine receptor type 3/Guanine nucleotide-binding protein subunit alpha-15
Name:C-X-C chemokine receptor type 3/Guanine nucleotide-binding protein subunit alpha-15
Synonyms:CXCR3A / G protein (Galpha(16))
Type:Protein
Mol. Mass.:n/a
Description:n/a
Components:This complex has 2 components.
Component 1
Name:C-X-C chemokine receptor type 3
Type:Enzyme Catalytic Domain
Mol. Mass.:40665.65
Organism:Homo sapiens (Human)
Description:n/a
Residue:368
Component 2
Name:Guanine nucleotide-binding protein subunit alpha-15
Synonyms:G-protein subunit alpha-16 GNA15 GNA16 | guanine nucleotide-binding protein subunit alpha-15
Type:Protein
Mol. Mass.:43577.62
Organism:Homo sapiens (Human)
Description:P30679
Residue:374
BDBM208632
NameBDBM208632
Synonyms:US9266876, 99
TypeSmall organic molecule
Emp. Form.C25H26N8OS
Mol. Mass.486.592
SMILESCCc1ccc2nc([nH]c2c1)-c1ncsc1N1CCN([C@H](C)C1)C(=O)Cn1cnc2cccnc12