Reaction Details
TargetInsulin-degrading enzyme
LigandBDBM209051
Substrate/Competitorn/a
Meas. Tech.IDE Activity Assay
IC50 60±n/a nM
Citation Liu, DRMaianti, JPSaghatelian, AKleiner, RE Macrocyclic insulin-degrading enzyme (IDE) inhibitors and uses thereof US Patent US9243038 Publication Date 1/26/2016
 
Insulin-degrading enzyme
Name:Insulin-degrading enzyme
Type:Enzyme Catalytic Domain
Mol. Mass.:117968.59
Organism:Homo sapiens (Human)
Description:P14735
Residue:1019
BDBM209051
NameBDBM209051
Synonyms:US9243038, 27
TypeSmall organic molecule
Emp. Form.C45H63N9O8
Mol. Mass.858.0372
SMILESCCNC(=O)C1CCCNNC(=O)\C=C/C(=O)N[C@@H](CCC(N)=O)C(=O)N[C@@H](CC2CCCCC2)C(=O)N[C@H](Cc2ccc(cc2)C(=O)c2ccccc2)C(=O)NCCCCN1