Reaction Details
TargetInsulin-degrading enzyme
LigandBDBM209024
Substrate/Competitorn/a
Meas. Tech.IDE Activity Assay
IC50 1.5e+2±n/a nM
Citation Liu, DRMaianti, JPSaghatelian, AKleiner, RE Macrocyclic insulin-degrading enzyme (IDE) inhibitors and uses thereof US Patent US9243038 Publication Date 1/26/2016
 
Insulin-degrading enzyme
Name:Insulin-degrading enzyme
Type:Enzyme Catalytic Domain
Mol. Mass.:117968.59
Organism:Homo sapiens (Human)
Description:P14735
Residue:1019
BDBM209024
NameBDBM209024
Synonyms:US9243038, 2a (cis olefin) | US9243038, 2b (trans olefin)
TypeSmall organic molecule
Emp. Form.C41H55N9O7
Mol. Mass.785.9315
SMILESNC(=N)NCCC[C@@H]1NC(=O)\C=C\C(=O)N[C@@H](CCCCNC(=O)[C@@H](Cc2ccc(cc2)C(=O)c2ccccc2)NC(=O)[C@H](CC2CCCCC2)NC1=O)C(N)=O