Reaction Details
TargetInsulin-degrading enzyme
LigandBDBM209038
Substrate/Competitorn/a
Meas. Tech.IDE Activity Assay
IC50 2.1e+3±n/a nM
Citation Liu, DRMaianti, JPSaghatelian, AKleiner, RE Macrocyclic insulin-degrading enzyme (IDE) inhibitors and uses thereof US Patent US9243038 Publication Date 1/26/2016
 
Insulin-degrading enzyme
Name:Insulin-degrading enzyme
Type:Enzyme Catalytic Domain
Mol. Mass.:117968.59
Organism:Homo sapiens (Human)
Description:P14735
Residue:1019
BDBM209038
NameBDBM209038
Synonyms:US9243038, 11
TypeSmall organic molecule
Emp. Form.C37H47N7O8
Mol. Mass.717.8112
SMILESCC(C)CC1NC(=O)[C@H](CCC(N)=O)NC(=O)\C=C\C(=O)N[C@@H](CCCCNC(=O)[C@@H](Cc2ccc(cc2)C(=O)c2ccccc2)NC1=O)C(N)=O