Reaction Details
TargetInsulin-degrading enzyme
LigandBDBM209040
Substrate/Competitorn/a
Meas. Tech.IDE Activity Assay
IC50>2.0e+4±n/a nM
Citation Liu, DRMaianti, JPSaghatelian, AKleiner, RE Macrocyclic insulin-degrading enzyme (IDE) inhibitors and uses thereof US Patent US9243038 Publication Date 1/26/2016
 
Insulin-degrading enzyme
Name:Insulin-degrading enzyme
Type:Enzyme Catalytic Domain
Mol. Mass.:117968.59
Organism:Homo sapiens (Human)
Description:P14735
Residue:1019
BDBM209040
NameBDBM209040
Synonyms:US9243038, 14
TypeSmall organic molecule
Emp. Form.C38H48N6O7
Mol. Mass.700.8237
SMILESC[C@H]1NC(=O)\C=C\C(=O)NC(CCCCNC(=O)[C@@H](Cc2ccc(cc2)C(=O)c2ccccc2)NC(=O)[C@H](CC2CCCCC2)NC1=O)C(N)=O