Reaction Details
TargetInsulin-degrading enzyme
LigandBDBM209052
Substrate/Competitorn/a
Meas. Tech.IDE Activity Assay
IC50 1e+2±n/a nM
Citation Liu, DRMaianti, JPSaghatelian, AKleiner, RE Macrocyclic insulin-degrading enzyme (IDE) inhibitors and uses thereof US Patent US9243038 Publication Date 1/26/2016
 
Insulin-degrading enzyme
Name:Insulin-degrading enzyme
Type:Enzyme Catalytic Domain
Mol. Mass.:117968.59
Organism:Homo sapiens (Human)
Description:P14735
Residue:1019
BDBM209052
NameBDBM209052
Synonyms:US9243038, 29
TypeSmall organic molecule
Emp. Form.C69H80N8O16
Mol. Mass.1277.4175
SMILESNC(=O)CC[C@@H]1NC(=O)\C=C/C(=O)NNCCCCC(NCCCCNC(=O)[C@@H](Cc2ccc(cc2)C(=O)c2ccccc2)NC(=O)[C@H](CC2CCCCC2)NC1=O)C(=O)COCCOCCOOc1ccc2c(Oc3cc(O)ccc3C22OC(=O)c3ccccc23)c1