Reaction Details
TargetInsulin-degrading enzyme
LigandBDBM209045
Substrate/Competitorn/a
Meas. Tech.IDE Activity Assay
IC50 90±n/a nM
Citation Liu, DRMaianti, JPSaghatelian, AKleiner, RE Macrocyclic insulin-degrading enzyme (IDE) inhibitors and uses thereof US Patent US9243038 Publication Date 1/26/2016
 
Insulin-degrading enzyme
Name:Insulin-degrading enzyme
Type:n/a
Mol. Mass.:117770.69
Organism:Mus musculus (Mouse)
Description:Q9JHR7
Residue:1019
BDBM209045
NameBDBM209045
Synonyms:US9243038, 20
TypeSmall organic molecule
Emp. Form.C41H55N7O7
Mol. Mass.757.9181
SMILESNCCCC[C@@H]1NC(=O)\C=C\C(=O)NC(CCCCNC(=O)[C@@H](Cc2ccc(cc2)C(=O)c2ccccc2)NC(=O)[C@H](CC2CCCCC2)NC1=O)C(N)=O