Reaction Details
TargetBcl-2-like protein 1
LigandBDBM209170
Substrate/Competitorn/a
Meas. Tech.Time Resolved-Fluorescence Resonance Energy Transfer (TR-FRET) Assay
Temperature298.15±n/a K
Ki<0.1±n/a nM
Commentsextracted
Citation Wang, LDoherty, GWang, XTao, ZBruncko, MKunzer, ARWendt, MDSong, XFrey, RHansen, TMSullivan, GMJudd, ASouers, A Apoptosis-inducing agents for the treatment of cancer and immune and autoimmune diseases US Patent US9266877 Publication Date 2/23/2016
 
Bcl-2-like protein 1
Name:Bcl-2-like protein 1
Type:Mitochondrion membrane; Single-pass membrane protein
Mol. Mass.:26039.60
Organism:Homo sapiens (Human)
Description:n/a
Residue:233
BDBM209170
NameBDBM209170
Synonyms:US9266877, 116
TypeSmall organic molecule
Emp. Form.C36H31N5O4S
Mol. Mass.629.727
SMILESOC(=O)c1nc(ccc1-c1cccc(OC2CCCCC2)c1C#N)N1CCc2cccc(C(=O)Nc3nc4ccccc4s3)c2C1