Reaction Details
TargetBcl-2-like protein 1
LigandBDBM209197
Substrate/Competitorn/a
Meas. Tech.FL5.12 Cellular Assay
EC50 19±n/a nM
Citation Wang, LDoherty, GWang, XTao, ZBruncko, MKunzer, ARWendt, MDSong, XFrey, RHansen, TMSullivan, GMJudd, ASouers, A Apoptosis-inducing agents for the treatment of cancer and immune and autoimmune diseases US Patent US9266877 Publication Date 2/23/2016
 
Bcl-2-like protein 1
Name:Bcl-2-like protein 1
Type:Protein
Mol. Mass.:26122.63
Organism:Mus musculus (Mouse)
Description:Q64373
Residue:233
BDBM209197
NameBDBM209197
Synonyms:US9266877, 143
TypeSmall organic molecule
Emp. Form.C36H30N6O3S
Mol. Mass.626.727
SMILESCN(c1ccccc1)c1nccc(c1C)-c1ccc(nc1C(O)=O)N1CCc2cccc(C(=O)Nc3nc4ccccc4s3)c2C1