Reaction Details
TargetFibroblast growth factor receptor 4 [388-802]
LigandBDBM209277
Substrate/Competitorn/a
Meas. Tech.Biochemical Kinase Assay
pH7.5±n/a
Temperature303.15±n/a K
IC50 0.3±n/a nM
Commentsextracted
Citation Buschmann, NFairhurst, RAFuret, PKnöpfel, TLeblanc, CLiao, LMah, RNimsgern, PRipoche, SXiong, JHan, BWang, CZhao, X Ring-fused bicyclic pyridyl derivatives as FGFR4 inhibitors US Patent US9266883 Publication Date 2/23/2016
 
Fibroblast growth factor receptor 4 [388-802]
Name:Fibroblast growth factor receptor 4 [388-802]
Type:Protein
Mol. Mass.:45529.19
Organism:Homo sapiens (Human)
Description:GST-FGFR4(388-802)
Residue:415
BDBM209277
NameBDBM209277
Synonyms:US9266883, 35
TypeSmall organic molecule
Emp. Form.C20H19N5O4
Mol. Mass.393.396
SMILESO=Cc1ccc2CCCN(C(=O)Nc3cc(OCC4CCO4)c(cn3)C#N)c2n1