Reaction Details
TargetFibroblast growth factor receptor 4 [388-802]
LigandBDBM209298
Substrate/Competitorn/a
Meas. Tech.Biochemical Kinase Assay
pH7.5±n/a
Temperature303.15±n/a K
IC50 1.7±n/a nM
Commentsextracted
Citation Buschmann, NFairhurst, RAFuret, PKnöpfel, TLeblanc, CLiao, LMah, RNimsgern, PRipoche, SXiong, JHan, BWang, CZhao, X Ring-fused bicyclic pyridyl derivatives as FGFR4 inhibitors US Patent US9266883 Publication Date 2/23/2016
 
Fibroblast growth factor receptor 4 [388-802]
Name:Fibroblast growth factor receptor 4 [388-802]
Type:Protein
Mol. Mass.:45529.19
Organism:Homo sapiens (Human)
Description:GST-FGFR4(388-802)
Residue:415
BDBM209298
NameBDBM209298
Synonyms:US9266883, 56
TypeSmall organic molecule
Emp. Form.C21H22N6O4
Mol. Mass.422.4372
SMILESOCc1cc2CCCN(C(=O)Nc3cc(NC4CCOC4)c(cn3)C#N)c2nc1C=O