Reaction Details
TargetFibroblast growth factor receptor 4 [388-802]
LigandBDBM209334
Substrate/Competitorn/a
Meas. Tech.Biochemical Kinase Assay
pH7.5±n/a
Temperature303.15±n/a K
IC50 0.4±n/a nM
Commentsextracted
Citation Buschmann, NFairhurst, RAFuret, PKnöpfel, TLeblanc, CLiao, LMah, RNimsgern, PRipoche, SXiong, JHan, BWang, CZhao, X Ring-fused bicyclic pyridyl derivatives as FGFR4 inhibitors US Patent US9266883 Publication Date 2/23/2016
 
Fibroblast growth factor receptor 4 [388-802]
Name:Fibroblast growth factor receptor 4 [388-802]
Type:Protein
Mol. Mass.:45529.19
Organism:Homo sapiens (Human)
Description:GST-FGFR4(388-802)
Residue:415
BDBM209334
NameBDBM209334
Synonyms:US9266883, 98
TypeSmall organic molecule
Emp. Form.C24H27N7O5
Mol. Mass.493.5151
SMILESCOCCNc1cc(NC(=O)N2CCCc3cc(CN4CCOCC4=O)c(C=O)nc23)ncc1C#N