Reaction Details
TargetFibroblast growth factor receptor 4 [388-802]
LigandBDBM209345
Substrate/Competitorn/a
Meas. Tech.Biochemical Kinase Assay
pH7.5±n/a
Temperature303.15±n/a K
IC50 0.3±n/a nM
Commentsextracted
Citation Buschmann, NFairhurst, RAFuret, PKnöpfel, TLeblanc, CLiao, LMah, RNimsgern, PRipoche, SXiong, JHan, BWang, CZhao, X Ring-fused bicyclic pyridyl derivatives as FGFR4 inhibitors US Patent US9266883 Publication Date 2/23/2016
 
Fibroblast growth factor receptor 4 [388-802]
Name:Fibroblast growth factor receptor 4 [388-802]
Type:Protein
Mol. Mass.:45529.19
Organism:Homo sapiens (Human)
Description:GST-FGFR4(388-802)
Residue:415
BDBM209345
NameBDBM209345
Synonyms:US9266883, 141
TypeSmall organic molecule
Emp. Form.C23H26N6O5
Mol. Mass.466.4897
SMILESCC(C)Oc1cc(NC(=O)N2CCCc3cc(CN(C)C(=O)CO)c(C=O)nc23)ncc1C#N