Reaction Details
TargetFibroblast growth factor receptor 4 [388-802]
LigandBDBM209354
Substrate/Competitorn/a
Meas. Tech.Biochemical Kinase Assay
pH7.5±n/a
Temperature303.15±n/a K
IC50 0.4±n/a nM
Commentsextracted
Citation Buschmann, NFairhurst, RAFuret, PKnöpfel, TLeblanc, CLiao, LMah, RNimsgern, PRipoche, SXiong, JHan, BWang, CZhao, X Ring-fused bicyclic pyridyl derivatives as FGFR4 inhibitors US Patent US9266883 Publication Date 2/23/2016
 
Fibroblast growth factor receptor 4 [388-802]
Name:Fibroblast growth factor receptor 4 [388-802]
Type:Protein
Mol. Mass.:45529.19
Organism:Homo sapiens (Human)
Description:GST-FGFR4(388-802)
Residue:415
BDBM209354
NameBDBM209354
Synonyms:US9266883, 188
TypeSmall organic molecule
Emp. Form.C23H24F3N7O4
Mol. Mass.519.4764
SMILESCN(Cc1cc2CCCN(C(=O)Nc3cc(NCCOC(F)(F)F)c(cn3)C#N)c2nc1C=O)C(C)=O