Reaction Details
TargetDual specificity protein kinase TTK
LigandBDBM209400
Substrate/Competitorn/a
Meas. Tech.LanthaScreen Activity Assay
Temperature298.15±n/a K
IC50 254.3±n/a nM
Commentsextracted
Citation Gray, NSDeng, XKwiatkowski, NP Pyrimido-diazepinone kinase scaffold compounds and methods of treating disorders US Patent US9266890 Publication Date 2/23/2016
 
Dual specificity protein kinase TTK
Name:Dual specificity protein kinase TTK
Type:Protein
Mol. Mass.:97086.79
Organism:Homo sapiens (Human)
Description:P33981
Residue:857
BDBM209400
NameBDBM209400
Synonyms:US9266890, I-9
TypeSmall organic molecule
Emp. Form.C26H36N6O3
Mol. Mass.480.6024
SMILESCOc1cc(ccc1Nc1ncc2N(C)C(=O)CCN(C3CCCC3)c2n1)N1CCC(C)(O)CC1