Reaction Details
TargetSerine/threonine-protein kinase PLK1
LigandBDBM209397
Substrate/Competitorn/a
Meas. Tech.In Vitro Plk1Binding Assay
Kd 19±n/a nM
Citation Gray, NSDeng, XKwiatkowski, NP Pyrimido-diazepinone kinase scaffold compounds and methods of treating disorders US Patent US9266890 Publication Date 2/23/2016
 
Serine/threonine-protein kinase PLK1
Name:Serine/threonine-protein kinase PLK1
Type:Serine/threonine-protein kinase
Mol. Mass.:68277.16
Organism:Homo sapiens (Human)
Description:P53350
Residue:603
BDBM209397
NameBDBM209397
Synonyms:US9266890, I-6
TypeSmall organic molecule
Emp. Form.C25H34N6O3
Mol. Mass.466.5759
SMILESCOc1cc(ccc1Nc1ncc2N(C)C(=O)CCN(C3CCCC3)c2n1)N1CCC(O)CC1