Reaction Details
TargetSerine/threonine-protein kinase PLK1
LigandBDBM209398
Substrate/Competitorn/a
Meas. Tech.In Vitro Plk1Binding Assay
Kd 36±n/a nM
Citation Gray, NSDeng, XKwiatkowski, NP Pyrimido-diazepinone kinase scaffold compounds and methods of treating disorders US Patent US9266890 Publication Date 2/23/2016
 
Serine/threonine-protein kinase PLK1
Name:Serine/threonine-protein kinase PLK1
Type:Serine/threonine-protein kinase
Mol. Mass.:68277.16
Organism:Homo sapiens (Human)
Description:P53350
Residue:603
BDBM209398
NameBDBM209398
Synonyms:US9266890, I-7
TypeSmall organic molecule
Emp. Form.C23H32N6O3
Mol. Mass.440.5386
SMILESCOc1cc(ccc1Nc1ncc2N(C)C(=O)CCN(C3CCCC3)c2n1)N(C)CCO