Reaction Details
TargetMitogen-activated protein kinase 7
LigandBDBM209414
Substrate/Competitorn/a
Meas. Tech.In vitro Erk5
Kd 320±n/a nM
Citation Gray, NSDeng, XKwiatkowski, NP Pyrimido-diazepinone kinase scaffold compounds and methods of treating disorders US Patent US9266890 Publication Date 2/23/2016
 
Mitogen-activated protein kinase 7
Name:Mitogen-activated protein kinase 7
Type:Protein
Mol. Mass.:88377.36
Organism:Homo sapiens (Human)
Description:Q13164
Residue:816
BDBM209414
NameBDBM209414
Synonyms:US9266890, I-24
TypeSmall organic molecule
Emp. Form.C23H28N6O2
Mol. Mass.420.5074
SMILESCN1c2cnc(Nc3ccc(cc3)C(N)=O)nc2N(C2CCCC2)[C@@H]2CCC[C@@H]2C1=O