Reaction Details
TargetMitogen-activated protein kinase 7
LigandBDBM50337126
Substrate/Competitorn/a
Meas. Tech.In vitro Erk5
Kd 670±n/a nM
Citation Gray, NSDeng, XKwiatkowski, NP Pyrimido-diazepinone kinase scaffold compounds and methods of treating disorders US Patent US9266890 Publication Date 2/23/2016
 
Mitogen-activated protein kinase 7
Name:Mitogen-activated protein kinase 7
Type:Protein
Mol. Mass.:88377.36
Organism:Homo sapiens (Human)
Description:Q13164
Residue:816
BDBM50337126
NameBDBM50337126
Synonyms:2-(2-methoxy-4-(4-methylpiperazin-1-yl)phenylamino)-11-methyl-5H-benzo[e]pyrimido[5,4-b][1,4]diazepin-6(11H)-one Scaffold, B19 | US9266890, IV-2
TypeSmall organic molecule
Emp. Form.C24H27N7O2
Mol. Mass.445.5169
SMILESCOc1cc(ccc1Nc1ncc2NC(=O)c3ccccc3N(C)c2n1)N1CCN(C)CC1