Reaction Details
TargetDiacylglycerol O-acyltransferase 1
LigandBDBM209532
Substrate/Competitorn/a
Meas. Tech.Inhibition Assay
pH7.4±n/a
Temperature298.15±n/a K
IC50 1.2±n/a nM
Commentsextracted
Citation Kim, DBok, JShin, S Compounds as inhibitors of diacylglycerol O-acyltransferase type 1 enzyme US Patent US9271969 Publication Date 3/1/2016
 
Diacylglycerol O-acyltransferase 1
Name:Diacylglycerol O-acyltransferase 1
Type:Enzyme
Mol. Mass.:56810.61
Organism:Mus musculus (mouse)
Description:In this assay, recombinant mouse DGAT-1 containing an N-terminal His6-epitope tag was produced in the baculovirus expression system.
Residue:498
BDBM209532
NameBDBM209532
Synonyms:US9271969, 20
TypeSmall organic molecule
Emp. Form.C31H32FN3O3
Mol. Mass.513.6025
SMILESCC(C)(NC(=O)c1cn2cc(ccc2n1)-c1ccc(cc1)C1CC[C@H](CC(O)=O)CC1)c1ccc(F)cc1