Reaction Details
TargetcAMP and cAMP-inhibited cGMP 3',5'-cyclic phosphodiesterase 10A
LigandBDBM209711
Substrate/Competitorn/a
Meas. Tech.PDE10 Fluorescence Polarization (FP) Assay
Temperature298.15±n/a K
Ki 0.014±n/a nM
Commentsextracted
Citation Kuduk, SDMcComas, CCReger, TS Substituted pyridone derivatives as PDE10 inhibitors US Patent US9273033 Publication Date 3/1/2016
 
cAMP and cAMP-inhibited cGMP 3',5'-cyclic phosphodiesterase 10A
Name:cAMP and cAMP-inhibited cGMP 3',5'-cyclic phosphodiesterase 10A
Type:Protein
Mol. Mass.:88412.52
Organism:Homo sapiens (Human)
Description:Q9Y233
Residue:779
BDBM209711
NameBDBM209711
Synonyms:US9273033, 9
TypeSmall organic molecule
Emp. Form.C26H26N4O2
Mol. Mass.426.5102
SMILESCC(C)n1cc(ccc1=O)-c1cnc(C)nc1OC[C@H]1C[C@@H]1c1ccc2ccccc2n1