Reaction Details
TargetcAMP and cAMP-inhibited cGMP 3',5'-cyclic phosphodiesterase 10A
LigandBDBM209829
Substrate/Competitorn/a
Meas. Tech.PDE10 Fluorescence Polarization (FP) Assay
Temperature298.15±n/a K
Ki 0.033±n/a nM
Commentsextracted
Citation Kuduk, SDMcComas, CCReger, TS Substituted pyridone derivatives as PDE10 inhibitors US Patent US9273033 Publication Date 3/1/2016
 
cAMP and cAMP-inhibited cGMP 3',5'-cyclic phosphodiesterase 10A
Name:cAMP and cAMP-inhibited cGMP 3',5'-cyclic phosphodiesterase 10A
Type:Protein
Mol. Mass.:88412.52
Organism:Homo sapiens (Human)
Description:Q9Y233
Residue:779
BDBM209829
NameBDBM209829
Synonyms:US9273033, 131
TypeSmall organic molecule
Emp. Form.C24H26N4O2
Mol. Mass.402.4888
SMILESCc1ncc(c(OC[C@H]2C[C@@H]2c2ccc3CCCc3n2)n1)-c1cc(=O)n(C)cc1C