Reaction Details
TargetBeta-secretase 1
LigandBDBM209915
Substrate/Competitorn/a
Meas. Tech.Cellular Aβ-Lowering Assay
Temperature310.15±n/a K
IC50 0.0061±n/a nM
Commentsextracted
Citation Hilpert, HWoltering, T 5-amino[1,4]thiazines as BACE 1 inhibitors US Patent US9273042 Publication Date 3/1/2016
 
Beta-secretase 1
Name:Beta-secretase 1
Type:Protein
Mol. Mass.:55755.10
Organism:Homo sapiens (Human)
Description:P56817
Residue:501
BDBM209915
NameBDBM209915
Synonyms:US9273042, 3 | US9556135, 29
TypeSmall organic molecule
Emp. Form.C17H16ClFN4O3S
Mol. Mass.410.85
SMILESC[C@]1(CS(=O)(=O)CC(N)=N1)c1cc(NC(=O)c2ccc(Cl)cn2)ccc1F