Reaction Details
TargetPoly [ADP-ribose] polymerase 1
LigandBDBM209857
Substrate/Competitorn/a
Meas. Tech.HTF Homologous PARP Inhibition Assay
Temperature298.15±n/a K
IC50 10.2±n/a nM
Commentsextracted
Citation Tang, PCLi, XLi, XChen, YWang, BZhu, Z Phthalazinone ketone derivative, preparation method thereof, and pharmaceutical use thereof US Patent US9273052 Publication Date 3/1/2016
 
Poly [ADP-ribose] polymerase 1
Name:Poly [ADP-ribose] polymerase 1
Type:n/a
Mol. Mass.:113114.22
Organism:Homo sapiens (Human)
Description:P09874
Residue:1014
BDBM209857
NameBDBM209857
Synonyms:US9273052, 19 | US9566277, 19
TypeSmall organic molecule
Emp. Form.C22H16F4N6O2
Mol. Mass.472.3951
SMILESFc1ccc(Cc2n[nH]c(=O)c3ccccc23)cc1C(=O)N1CCn2nc(nc2C1)C(F)(F)F