Reaction Details
TargetEphrin type-A receptor 2 [596-900]
LigandBDBM50277545
Substrate/Competitorn/a
Meas. Tech.Kinobeads Competition Assay
Kd 187±0.0 nM
Citation Heinzlmeir, SKudlinzki, DSreeramulu, SKlaeger, SGande, SLLinhard, VWilhelm, MQiao, HHelm, DRuprecht, BSaxena, KMédard, GSchwalbe, HKuster, B Chemical Proteomics and Structural Biology Define EPHA2 Inhibition by Clinical Kinase Drugs. ACS Chem Biol11:3400-3411 (2016) 
 
Ephrin type-A receptor 2 [596-900]
Name:Ephrin type-A receptor 2 [596-900]
Type:Protein
Mol. Mass.:34367.96
Organism:Homo sapiens (Human)
Description:EPHA2 truncation (596-900 aa); 519U
Residue:305
BDBM50277545
NameBDBM50277545
Synonyms:4-(9-chloro-7-(2-fluoro-6-methoxyphenyl)-5H-benzo[c]pyrimido[4,5-e]azepin-2-ylamino)-2-methoxybenzoic acid CHEMBL483158 US10092556, Example MLN8237 | US9346787, MLN8237
TypeSmall organic molecule
Emp. Form.C27H20ClFN4O4
Mol. Mass.518.924
SMILESCOc1cc(Nc2ncc3CN=C(c4cc(Cl)ccc4-c3n2)c2c(F)cccc2OC)ccc1C(O)=O