Reaction Details
TargetEphrin type-A receptor 2 [596-900]
LigandBDBM50311316
Substrate/Competitorn/a
Meas. Tech.Kinobeads Competition Assay
Kd 165±0.0 nM
Citation Heinzlmeir, SKudlinzki, DSreeramulu, SKlaeger, SGande, SLLinhard, VWilhelm, MQiao, HHelm, DRuprecht, BSaxena, KMédard, GSchwalbe, HKuster, B Chemical Proteomics and Structural Biology Define EPHA2 Inhibition by Clinical Kinase Drugs. ACS Chem Biol11:3400-3411 (2016) 
 
Ephrin type-A receptor 2 [596-900]
Name:Ephrin type-A receptor 2 [596-900]
Type:Protein
Mol. Mass.:34367.96
Organism:Homo sapiens (Human)
Description:EPHA2 truncation (596-900 aa); 519U
Residue:305
BDBM50311316
NameBDBM50311316
Synonyms:CHEMBL1077739 N-(2-chlorophenyl)-6-(piperidin-4-yl)imidazo[1,2-a]pyridine-3-carboxamide, oxalate salt
TypeSmall organic molecule
Emp. Form.C19H19ClN4O
Mol. Mass.354.833
SMILESClc1ccccc1NC(=O)c1cnc2ccc(cn12)C1CCNCC1