Reaction Details
TargetTyrosine-protein kinase JAK1
LigandBDBM159756
Substrate/Competitorn/a
Meas. Tech.JAK Enzyme Assay
pH7.4±n/a
Temperature298.15±n/a K
IC50 1.0±0.12 nM
Commentsextracted
Citation Telliez, JBDowty, MEWang, LJussif, JLin, TLi, LMoy, EBalbo, PLi, WZhao, YCrouse, KDickinson, CSymanowicz, PHegen, MBanker, MEVincent, FUnwalla, RLiang, SGilbert, AMBrown, MFHayward, MMontgomery, JYang, XBauman, JTrujillo, JICasimiro-Garcia, AVajdos, FFLeung, LGeoghegan, KFQuazi, AXuan, DJones, LHett, EWright, KClark, JDThorarensen, A Discovery of a JAK3-Selective Inhibitor: Functional Differentiation of JAK3-Selective Inhibition over pan-JAK or JAK1-Selective Inhibition. ACS Chem Biol11:3442-3451 (2016) 
 
Tyrosine-protein kinase JAK1
Name:Tyrosine-protein kinase JAK1
Type:Protein
Mol. Mass.:133293.73
Organism:Homo sapiens (Human)
Description:P23458
Residue:1154
BDBM159756
NameBDBM159756
Synonyms:PF-02384554 US9035074, 8
TypeSmall organic molecule
Emp. Form.C17H17N7O2S
Mol. Mass.383.428
SMILESCN([C@@H]1C[C@@H](C1)NS(=O)(=O)c1cc(ccn1)C#N)c1ncnc2[nH]ccc12