Reaction Details
TargetKappa-type opioid receptor
LigandBDBM209923
Substrate/Competitorn/a
Meas. Tech.[35S]GTPγS Coupling Assay
IC50 0.07±0.02 nM
Citation Schmid, CLStreicher, JMGroer, CEMunro, TAZhou, LBohn, LM Functional selectivity of 6'-guanidinonaltrindole (6'-GNTI) at kappa-opioid receptors in striatal neurons. J Biol Chem288:22387-98 (2013) 
 
Kappa-type opioid receptor
Name:Kappa-type opioid receptor
Type:G Protein-Coupled Receptor (GPCR)
Mol. Mass.:42648.76
Organism:Homo sapiens (Human)
Description:P41145
Residue:380
BDBM209923
NameBDBM209923
Synonyms:5'-Guanidinonaltrindole (5'-GNTI)
TypeSmall organic molecule
Emp. Form.C27H29N5O3
Mol. Mass.471.5509
SMILESNC(N)=Nc1ccc2[nH]c3[C@@H]4Oc5c6c(C[C@@H]7N(CC8CC8)CC[C@@]46[C@@]7(O)Cc3c2c1)ccc5O