Reaction Details
TargetGDH/6PGL endoplasmic bifunctional protein
LigandBDBM50446130
Substrate/Competitorn/a
Meas. Tech.H6PD Activity Assay
IC50 1.8e+4±n/a nM
Citation Knezevic, CEWright, GRemsing Rix, LLKim, WKuenzi, BMLuo, YWatters, JMKoomen, JMHaura, EBMonteiro, ANRadu, CLawrence, HRRix, U Proteome-wide Profiling of Clinical PARP Inhibitors Reveals Compound-Specific Secondary Targets. Cell Chem Biol23:1490-1503 (2016) 
 
GDH/6PGL endoplasmic bifunctional protein
Name:GDH/6PGL endoplasmic bifunctional protein
Type:Protein
Mol. Mass.:88905.23
Organism:Homo sapiens (Human)
Description:O95479
Residue:791
BDBM50446130
NameBDBM50446130
Synonyms:AG-014699 RUCAPARIB CAMSYLATE | Rucaparib
TypeSmall organic molecule
Emp. Form.C19H18FN3O
Mol. Mass.323.3641
SMILESCNCc1ccc(cc1)-c1[nH]c2cc(F)cc3C(=O)NCCc1c23