Reaction Details
TargetAurora kinase A
LigandBDBM92800
Substrate/Competitorn/a
Meas. Tech.In Vitro Aurora A Activity Assay (DiscoverX)
pH7.4±n/a
Temperature298.15±n/a K
IC50 0.8±0.16 nM
Commentsextracted
Citation Sebti, SMSchönbrunn, ELawrence, NJLawrence, HRMartin, MP Aurora kinase inhibitors and methods of making and using thereof US Patent US9249124 Publication Date 2/2/2016
 
Aurora kinase A
Name:Aurora kinase A
Type:Serine/threonine-protein kinase
Mol. Mass.:45830.98
Organism:Homo sapiens (Human)
Description:O14965
Residue:403
BDBM92800
NameBDBM92800
Synonyms:Bisanilinopyrimidine, 3o | US9249124, 16
TypeSmall molecule
Emp. Form.C17H12ClFN4O2
Mol. Mass.358.754
SMILESOC(=O)c1ccc(Nc2ncc(F)c(Nc3ccccc3Cl)n2)cc1