Reaction Details
TargetTransient receptor potential cation channel subfamily V member 1
LigandBDBM210898
Substrate/Competitorn/a
Meas. Tech.pH-based Assay
pH7.2±n/a
Temperature310.15±n/a K
IC50 0.4±0 nM
Commentsextracted
Citation Kurose, NTafesse, L TRPV1 antagonists including dihydroxy substituent and uses thereof US Patent US9273043 Publication Date 3/1/2016
 
Transient receptor potential cation channel subfamily V member 1
Name:Transient receptor potential cation channel subfamily V member 1
Type:Protein
Mol. Mass.:94960.75
Organism:Homo sapiens (Human)
Description:Q8NER1
Residue:839
BDBM210898
NameBDBM210898
Synonyms:US9273043, A126(e)
TypeSmall organic molecule
Emp. Form.C21H24FN5O3S
Mol. Mass.445.51
SMILESC[C@@H]1CN(CCN1C(=O)Nc1nc2ccc(C)cc2s1)c1ncc(cc1F)[C@@H](O)CO