Reaction Details
TargetRAF proto-oncogene serine/threonine-protein kinase
LigandBDBM210039
Substrate/Competitorn/a
Meas. Tech.Raf IC50 Assay
Temperature298.15±n/a K
IC50 1.2±n/a nM
Commentsextracted
Citation Zhou, CWang, SZhang, G Fused tricyclic compounds as Raf kinase inhibitors US Patent US9273046 Publication Date 3/1/2016
 
RAF proto-oncogene serine/threonine-protein kinase
Name:RAF proto-oncogene serine/threonine-protein kinase
Type:Serine/threonine-protein kinase
Mol. Mass.:73082.52
Organism:Homo sapiens (Human)
Description:P04049
Residue:648
BDBM210039
NameBDBM210039
Synonyms:US9273046, 2.2a
TypeSmall organic molecule
Emp. Form.C25H17F3N4O3
Mol. Mass.478.4227
SMILESFC(F)(F)c1ccc2nc([nH]c2c1)C1[C@H]2Oc3ccc(Oc4ccnc5NC(=O)CCc45)cc3[C@@H]12