Reaction Details
TargetRAF proto-oncogene serine/threonine-protein kinase
LigandBDBM210044
Substrate/Competitorn/a
Meas. Tech.Raf IC50 Assay
Temperature298.15±n/a K
IC50<0.56±n/a nM
Commentsextracted
Citation Zhou, CWang, SZhang, G Fused tricyclic compounds as Raf kinase inhibitors US Patent US9273046 Publication Date 3/1/2016
 
RAF proto-oncogene serine/threonine-protein kinase
Name:RAF proto-oncogene serine/threonine-protein kinase
Type:Serine/threonine-protein kinase
Mol. Mass.:73082.52
Organism:Homo sapiens (Human)
Description:P04049
Residue:648
BDBM210044
NameBDBM210044
Synonyms:US10576087, Compound 2.4 US9895376, Compound 2.4
TypeSmall organic molecule
Emp. Form.C25H19FN4O3
Mol. Mass.442.4418
SMILESCc1cc2[nH]c(nc2cc1F)C1C2Oc3ccc(Oc4ccnc5NC(=O)CCc45)cc3C12