Reaction Details
TargetCannabinoid receptor 2
LigandBDBM210658
Substrate/Competitorn/a
Meas. Tech.cAMP Assay
Temperature310.15±n/a K
EC50 0.2±n/a nM
Commentsextracted
Citation Bissantz, CGrether, UHebeisen, PKimbara, ALiu, QNettekoven, MPrunotto, MRoever, SRogers-Evans, MSchulz-Gasch, TUllmer, CWang, ZYang, W Pyridine derivatives as agonists of the CB2 receptor US Patent US9290451 Publication Date 3/22/2016
 
Cannabinoid receptor 2
Name:Cannabinoid receptor 2
Type:G Protein-Coupled Receptor (GPCR)
Mol. Mass.:39690.94
Organism:Homo sapiens (Human)
Description:P34972
Residue:360
BDBM210658
NameBDBM210658
Synonyms:US9290451, 326
TypeSmall organic molecule
Emp. Form.C22H24FN3O2
Mol. Mass.381.4433
SMILESNC(=O)[C@H](CC1CC1)NC(=O)c1ccc(C2CC2)c(Cc2ccc(F)cc2)n1