Reaction Details
TargetCannabinoid receptor 1
LigandBDBM210612
Substrate/Competitorn/a
Meas. Tech.cAMP Assay
Temperature310.15±n/a K
EC50 603.2±n/a nM
Commentsextracted
Citation Bissantz, CGrether, UHebeisen, PKimbara, ALiu, QNettekoven, MPrunotto, MRoever, SRogers-Evans, MSchulz-Gasch, TUllmer, CWang, ZYang, W Pyridine derivatives as agonists of the CB2 receptor US Patent US9290451 Publication Date 3/22/2016
 
Cannabinoid receptor 1
Name:Cannabinoid receptor 1
Type:G Protein-Coupled Receptor (GPCR)
Mol. Mass.:52868.96
Organism:Homo sapiens (Human)
Description:P21554
Residue:472
BDBM210612
NameBDBM210612
Synonyms:US9290451, 299
TypeSmall organic molecule
Emp. Form.C20H26F5N3O3
Mol. Mass.451.4308
SMILESCNC(=O)[C@H](CC(C)(C)C)NC(=O)c1ccc(C2CC2)c(OCC(F)(F)C(F)(F)F)n1