Reaction Details
TargetCannabinoid receptor 1
LigandBDBM210616
Substrate/Competitorn/a
Meas. Tech.cAMP Assay
Temperature310.15±n/a K
EC50>10000±n/a nM
Commentsextracted
Citation Bissantz, CGrether, UHebeisen, PKimbara, ALiu, QNettekoven, MPrunotto, MRoever, SRogers-Evans, MSchulz-Gasch, TUllmer, CWang, ZYang, W Pyridine derivatives as agonists of the CB2 receptor US Patent US9290451 Publication Date 3/22/2016
 
Cannabinoid receptor 1
Name:Cannabinoid receptor 1
Type:G Protein-Coupled Receptor (GPCR)
Mol. Mass.:52868.96
Organism:Homo sapiens (Human)
Description:P21554
Residue:472
BDBM210616
NameBDBM210616
Synonyms:US9290451, 302
TypeSmall organic molecule
Emp. Form.C18H15F6N3O2
Mol. Mass.419.321
SMILESFC(F)(F)COc1nc(ccc1C1CC1)C(=O)NC(c1ccccn1)C(F)(F)F