Reaction Details
TargetCannabinoid receptor 1
LigandBDBM210669
Substrate/Competitorn/a
Meas. Tech.cAMP Assay
Temperature310.15±n/a K
EC50>10000±n/a nM
Commentsextracted
Citation Bissantz, CGrether, UHebeisen, PKimbara, ALiu, QNettekoven, MPrunotto, MRoever, SRogers-Evans, MSchulz-Gasch, TUllmer, CWang, ZYang, W Pyridine derivatives as agonists of the CB2 receptor US Patent US9290451 Publication Date 3/22/2016
 
Cannabinoid receptor 1
Name:Cannabinoid receptor 1
Type:G Protein-Coupled Receptor (GPCR)
Mol. Mass.:52868.96
Organism:Homo sapiens (Human)
Description:P21554
Residue:472
BDBM210669
NameBDBM210669
Synonyms:US9290451, 334
TypeSmall organic molecule
Emp. Form.C20H25N5O4
Mol. Mass.399.4436
SMILESCc1nc(no1)C(C)(C)NC(=O)c1ccc(N2CCC(=O)C2)c(OCC2CC2)n1