Reaction Details
Target5-hydroxytryptamine receptor 1A/2C
LigandBDBM210830
Substrate/Competitorn/a
Meas. Tech.In Vitro Agonist Binding Assay
pH7.4±n/a
Temperature277.15±n/a K
Ki 6±n/a nM
Commentsextracted
Citation Mann, JJKumar, JS Radiolabeled compounds and uses thereof US Patent US9290463 Publication Date 3/22/2016
 
5-hydroxytryptamine receptor 1A/2C
Name:5-hydroxytryptamine receptor 1A/2C
Synonyms:5-HT1A/ 5-HT2c
Type:Protein
Mol. Mass.:n/a
Description:n/a
Components:This complex has 2 components.
Component 1
Name:5-hydroxytryptamine receptor 1A
Type:n/a
Mol. Mass.:46122.49
Organism:Homo sapiens (Human)
Description:n/a
Residue:422
Component 2
Name:5-hydroxytryptamine receptor 2C
Synonyms:5-HT-2C 5-HT2C-INI 5-HTR2C 5-hydroxytryptamine receptor 2C (5-HT-2C) 5HT-1C HTR1C Serotonin (5-HT3) receptor Serotonin Receptor 2C
Type:G Protein-Coupled Receptor (GPCR)
Mol. Mass.:51836.79
Organism:Homo sapiens (Human)
Description:P28335
Residue:458
BDBM210830
NameBDBM210830
Synonyms:US9290463, D
TypeSmall organic molecule
Emp. Form.C18H24BrN5O2
Mol. Mass.422.319
SMILESCn1c(=O)cnn(CCCCN2CCN(CC2)c2ccccc2Br)c1=O