Reaction Details
TargetProcathepsin L
LigandBDBM210881
Substrate/CompetitorBDBM210882
Meas. Tech.Cathepsin Enzyme Inhibition Assay
pH6.5±n/a
IC50 1.6±n/a nM
Commentsextracted
Citation Anselm, LBanner, DBlanc, JGaufreteau, DHaap, WHartmann, GKuhn, BLuebbers, TPeters, JSpinnler, B Cyclic amides US Patent US9290467 Publication Date 3/22/2016
 
Procathepsin L
Name:Procathepsin L
Type:Enzyme
Mol. Mass.:37557.19
Organism:Homo sapiens (Human)
Description:Purchased from Calbiochem (San Diego, CA).
Residue:333
BDBM210881
BDBM210882
NameBDBM210881
Synonyms:US9290467, 51
TypeSmall organic molecule
Emp. Form.C25H26ClN3O4S
Mol. Mass.500.01
SMILESCSc1ccc2OCCCCOc3ccc(C[C@H](NC(=O)c2c1)C(=O)NC1(CC1)C#N)cc3Cl