Reaction Details
TargetCarbonic anhydrase 1
LigandBDBM210937
Substrate/Competitorn/a
Meas. Tech.CA Inhibition Assay
Ki 1200±0.0 nM
Citation Bhatt, AMahon, BPCruzeiro, VWCornelio, BLaronze-Cochard, MCeruso, MSapi, JRance, GAKhlobystov, ANFontana, ARoitberg, ASupuran, CTMcKenna, R Structure-Activity Relationships of Benzenesulfonamide-Based Inhibitors towards Carbonic Anhydrase Isoform Specificity. Chembiochem18:213-222 (2017) 
 
Carbonic anhydrase 1
Name:Carbonic anhydrase 1
Type:Enzyme
Mol. Mass.:28873.37
Organism:Homo sapiens (Human)
Description:P00915
Residue:261
BDBM210937
NameBDBM210937
Synonyms:4-(3-formylphenyl)-benzenesulfonamide (4e)
TypeSmall organic molecule
Emp. Form.C13H11NO3S
Mol. Mass.261.296
SMILESNS(=O)(=O)c1ccc(cc1)-c1cccc(C=O)c1