Reaction Details
TargetCarbonic anhydrase 2 [A65S,N67Q,E69T,I91L,F131V,K170E,L204A]
LigandBDBM210938
Substrate/Competitorn/a
Meas. Tech.CA Inhibition Assay
Ki 0.2±0.0 nM
Citation Bhatt, AMahon, BPCruzeiro, VWCornelio, BLaronze-Cochard, MCeruso, MSapi, JRance, GAKhlobystov, ANFontana, ARoitberg, ASupuran, CTMcKenna, R Structure-Activity Relationships of Benzenesulfonamide-Based Inhibitors towards Carbonic Anhydrase Isoform Specificity. Chembiochem18:213-222 (2017) 
 
Carbonic anhydrase 2 [A65S,N67Q,E69T,I91L,F131V,K170E,L204A]
Name:Carbonic anhydrase 2 [A65S,N67Q,E69T,I91L,F131V,K170E,L204A]
Type:Protein
Mol. Mass.:29162.54
Organism:Homo sapiens (Human)
Description:Chimeric protein of CA II with 7 mutations (A65S, N67Q, E69T, I91L, F131V, K170E, L204A); 5sZ4, 5SZ5, 5SZ6, 5SZ7
Residue:260
BDBM210938
NameBDBM210938
Synonyms:4-(3-quinolinyl)-benzenesulfonamide (4p)
TypeSmall organic molecule
Emp. Form.C15H12N2O2S
Mol. Mass.284.333
SMILESNS(=O)(=O)c1ccc(cc1)-c1cnc2ccccc2c1