Reaction Details
TargetCarbonic anhydrase 12
LigandBDBM210935
Substrate/Competitorn/a
Meas. Tech.CA Inhibition Assay
Ki 93±0.0 nM
Citation Bhatt, AMahon, BPCruzeiro, VWCornelio, BLaronze-Cochard, MCeruso, MSapi, JRance, GAKhlobystov, ANFontana, ARoitberg, ASupuran, CTMcKenna, R Structure-Activity Relationships of Benzenesulfonamide-Based Inhibitors towards Carbonic Anhydrase Isoform Specificity. Chembiochem18:213-222 (2017) 
 
Carbonic anhydrase 12
Name:Carbonic anhydrase 12
Type:Enzyme
Mol. Mass.:39456.00
Organism:Homo sapiens (Human)
Description:Catalytic domain of human cloned isozyme was used in the assay
Residue:354
BDBM210935
NameBDBM210935
Synonyms:4-(phenyl)-bezenesulfonamide (4a)
TypeSmall organic molecule
Emp. Form.C12H11NO2S
Mol. Mass.233.286
SMILESNS(=O)(=O)c1ccc(cc1)-c1ccccc1