Reaction Details
TargetHeat shock protein HSP 90-alpha
LigandBDBM210950
Substrate/Competitorn/a
Meas. Tech.Fluorescence Polarization (FP) Assay
pH7.3±n/a
Kd>1.00e+5±n/a nM
Commentsextracted
Citation Mishra, SJGhosh, SStothert, ARDickey, CABlagg, BS Transformation of the Non-Selective Aminocyclohexanol-Based Hsp90 Inhibitor into a Grp94-Seletive Scaffold. ACS Chem Biol12:244-253 (2017) 
 
Heat shock protein HSP 90-alpha
Name:Heat shock protein HSP 90-alpha
Type:Molecular Chaperone
Mol. Mass.:84623.45
Organism:Homo sapiens (Human)
Description:P07900
Residue:732
BDBM210950
NameBDBM210950
Synonyms:2-(((1r,4r)-4-hydroxycyclohexyl)amino)-4-(2-phenethyl-1H-pyrrol-1-yl)benzamide (9) | US10975030, Compound 9
TypeSmall organic molecule
Emp. Form.C25H29N3O2
Mol. Mass.403.5167
SMILESNC(=O)c1ccc(cc1NC1CCC(O)CC1)-n1cccc1CCc1ccccc1