Reaction Details
TargetTyrosine-protein kinase SYK [2-635]
LigandBDBM211959
Substrate/Competitorn/a
Meas. Tech.Chip Based Microfluidic Mobility Shift Assay
pH7.5±n/a
Temperature303.15±n/a K
IC50 0.5±n/a nM
Commentsextracted
Citation Smith, ABThoma, GVan Eis, M Monocyclic heteroaryl cycloalkyldiamine derivatives US Patent US9290481 Publication Date 3/22/2016
 
Tyrosine-protein kinase SYK [2-635]
Name:Tyrosine-protein kinase SYK [2-635]
Type:Protein
Mol. Mass.:71948.80
Organism:Homo sapiens (Human)
Description:Human Syk (2-635 aa) (UniProtKB: P43405)
Residue:634
BDBM211959
NameBDBM211959
Synonyms:US9290481, 3.1
TypeSmall organic molecule
Emp. Form.C20H24N6O2
Mol. Mass.380.4436
SMILESCn1ccc2c(Nc3nc(N[C@@H]4CCCC[C@@H]4N)cnc3C(O)=O)cccc12