Reaction Details
TargetPlasma kallikrein
LigandBDBM212141
Substrate/Competitorn/a
Meas. Tech.In-vitro Plasma Kallikrein Inhibition
pH7.8±n/a
Temperature298.15±n/a K
IC50 0.4±n/a nM
Commentsextracted
Citation Brandl, TFlohr, SKopec, SLachal, JMarkert, CNamoto, KNganga, PPirard, BRenatus, MSedrani, RZoller, T N-((6-amino-pyridin-3-yl)methyl)-heteroaryl-carboxamides US Patent US9290485 Publication Date 3/22/2016
 
Plasma kallikrein
Name:Plasma kallikrein
Type:Protein
Mol. Mass.:71391.16
Organism:Homo sapiens (Human)
Description:P03952
Residue:638
BDBM212141
NameBDBM212141
Synonyms:US9290485, 173
TypeSmall organic molecule
Emp. Form.C27H29ClN6O3
Mol. Mass.521.011
SMILESCc1cc(NC(=O)OC(C)(C)C)nc(C)c1CNC(=O)c1cnn(Cc2ccc3ncc(Cl)cc3c2)c1