Reaction Details
TargetCD63 antigen
LigandBDBM212280
Substrate/Competitorn/a
Meas. Tech.High Throughput Syk Biochemical Assay
pH7±n/a
IC50 734±n/a nM
Commentsextracted
Citation Blomgren, PACurrie, KSKropf, JELee, SHLo, JRMitchell, SASchmitt, ACXiong, JXu, JZhao, ZSwaminathan, S Substituted imidazo[1,2-a]pyrazines as Syk inhibitors US Patent US9290505 Publication Date 3/22/2016
 
CD63 antigen
Name:CD63 antigen
Type:n/a
Mol. Mass.:25640.41
Organism:Homo sapiens (Human)
Description:n/a
Residue:238
BDBM212280
NameBDBM212280
Synonyms:US11517570, Example Kn.-4: US9504684, 6-(6-aminopyridin-3-yl)-N-(3,4-dimethoxyphenyl)imidazo[1,2-a]pyrazin-8-amine
TypeSmall organic molecule
Emp. Form.C19H18N6O2
Mol. Mass.362.3852
SMILESCOc1ccc(Nc2nc(cn3ccnc23)-c2ccc(N)nc2)cc1OC