Reaction Details
TargetTyrosine-protein kinase SYK
LigandBDBM212271
Substrate/Competitorn/a
Meas. Tech.High Throughput Syk Biochemical Assay
pH7±n/a
IC50 13.5±n/a nM
Commentsextracted
Citation Blomgren, PACurrie, KSKropf, JELee, SHLo, JRMitchell, SASchmitt, ACXiong, JXu, JZhao, ZSwaminathan, S Substituted imidazo[1,2-a]pyrazines as Syk inhibitors US Patent US9290505 Publication Date 3/22/2016
 
Tyrosine-protein kinase SYK
Name:Tyrosine-protein kinase SYK
Type:Enzyme
Mol. Mass.:72079.99
Organism:Homo sapiens (Human)
Description:P43405
Residue:635
BDBM212271
NameBDBM212271
Synonyms:6-(6-aminopyrazin-2-yl)-N-(4-(4-(oxetan-3-yl)piperazin-1-yl)phenyl)imidazo[1,2-a]pyrazin-8-amine US10828299, Example Ex.-2 US9290505, Ex.-2 US9931338, Ex.-2
TypeSmall organic molecule
Emp. Form.C23H25N9O
Mol. Mass.443.5043
SMILESNc1cncc(n1)-c1cn2ccnc2c(Nc2ccc(cc2)N2CCN(CC2)C2COC2)n1