Reaction Details
TargetTyrosine-protein kinase SYK
LigandBDBM212276
Substrate/Competitorn/a
Meas. Tech.High Throughput Syk Biochemical Assay
pH7±n/a
IC50 8.7±n/a nM
Commentsextracted
Citation Blomgren, PACurrie, KSKropf, JELee, SHLo, JRMitchell, SASchmitt, ACXiong, JXu, JZhao, ZSwaminathan, S Substituted imidazo[1,2-a]pyrazines as Syk inhibitors US Patent US9290505 Publication Date 3/22/2016
 
Tyrosine-protein kinase SYK
Name:Tyrosine-protein kinase SYK
Type:Enzyme
Mol. Mass.:72079.99
Organism:Homo sapiens (Human)
Description:P43405
Residue:635
BDBM212276
NameBDBM212276
Synonyms:2-(5-((6-(6-amino-5-methylpyrazin-2-yl)imidazo[1,2-a]pyrazin-8-yl)amino)-2-(4-(oxetan-3-yl)piperazin-1-yl)phenoxy)ethanol US10828299, Example Ex.-7 US9290505, Ex.-7 US9931338, Ex.-7
TypeSmall organic molecule
Emp. Form.C26H31N9O3
Mol. Mass.517.5828
SMILESCc1ncc(nc1N)-c1cn2ccnc2c(Nc2ccc(N3CCN(CC3)C3COC3)c(OCCO)c2)n1